{"text_format":"1","workbook":"xlsx","n_sheets":16,"sheets":["Contenido","Pre_Genero","Edad","Estrato","Colegio","Departamento","Municipio","Región","Excepcion","Pos_Genero","Res_Municipios","Ins_Cup_Adm","Icfes","Ind_Cobertura","Tendencia","CONVENCIONES"],"not_rendered":{"charts":11,"images":3,"macros":1,"external_links":0,"defined_names":9,"comments":0,"pivot_tables":0},"unopened":[],"bounds":{"document_bytes":16777216,"sheet_cells":100000,"rows_first":2000,"rows_last":500,"rows_between":2000,"halvings":0,"cell_chars":16384,"cell_head_chars":4096},"cells_cut":0,"cells_raw":0,"read":"whole","date_system":"1900"}

{"sheet":"Contenido","index":0,"n_rows":0,"n_cols":0,"rows_kept":0,"cut":false,"hidden":false,"merged":[]}

{"sheet":"Pre_Genero","index":1,"n_rows":76,"n_cols":10,"rows_kept":76,"cut":false,"hidden":false,"merged":[[56,1,60,1],[61,1,69,1],[70,1,70,3],[0,0,0,12],[32,1,32,9],[34,1,35,1],[34,2,35,2],[34,3,35,3],[34,4,34,6],[34,7,34,9],[36,1,39,1],[40,1,41,1],[43,1,48,1],[49,1,52,1],[53,1,54,1],[10,1,10,9]]}
["BOLETÍN ESTADÍSTICO 2011\nESTUDIANTES DE PREGRADO MATRICULADOS POR PRIMERA VEZ POR GÉNERO"]
[]
[]
[]
[]
[]
[]
[]
[]
[]
[null,"Seleccione un Programa Académico de Pregrado"]
[]
[null,null,null,null,null,null,null,1,{"$f":"VLOOKUP(H13,CONVENCIONES!A33:B66,2,FALSE)","v":"Administración del Medio Ambiente"}]
[]
[]
[]
[]
[]
[]
[]
[]
[]
[]
[]
[]
[]
[]
[]
[null,null,null,null,"MASCULINO","FEMENINO"]
[null,null,null,"SEMESTRE I",{"$f":"VLOOKUP($I$13,$D$37:$I$70,2,FALSE)","v":33},{"$f":"VLOOKUP($I$13,$D$37:$I$70,3,FALSE)","v":49}]
{"$rows_left_out":47}
{"sheet":"Edad","index":2,"n_rows":107,"n_cols":18,"rows_kept":107,"cut":false,"hidden":false,"merged":[[40,1,43,1],[44,1,45,1],[36,1,36,16],[38,1,39,1],[38,2,39,2],[38,3,39,3],[77,17,78,17],[75,1,75,17],[71,1,71,3],[52,1,55,1],[56,1,57,1],[59,1,63,1],[64,1,70,1],[10,1,10,17],[0,0,0,18],[97,1,103,1],[104,1,104,3],[80,1,81,1],[82,1,85,1],[86,1,89,1],[90,1,91,1],[93,1,96,1],[47,1,51,1],[38,4,38,16],[38,17,39,17],[77,1,78,1],[77,2,78,2],[77,3,78,3],[77,4,77,16]]}
["BOLETÍN ESTADÍSTICO 2011\nESTUDIANTES DE PREGRADO MATRICULADOS POR PRIMERA VEZ POR EDAD"]
[]
[]
[]
[]
[]
[]
[]
[]
[]
[null,"Seleccione un Programa Académico de Pregrado"]
[]
[null,null,null,null,null,null,null,null,1,{"$f":"VLOOKUP(I13,CONVENCIONES!A33:B66,2,FALSE)","v":"Administración del Medio Ambiente"}]
[]
[]
[]
[]
[]
[]
[]
[]
[]
[]
[]
[]
[]
[]
[]
[null,null,null,"SEMESTRE I",{"$f":"VLOOKUP($J$13,$D$41:$Q$71,2,FALSE)","v":0},{"$f":"VLOOKUP($J$13,$D$41:$Q$71,3,FALSE)","v":0},{"$f":"VLOOKUP($J$13,$D$41:$Q$71,4,FALSE)","v":5},{"$f":"VLOOKUP($J$13,$D$41:$Q$71,5,FALSE)","v":42},{"$f":"VLOOKUP($J$13,$D$41:$Q$71,6,FALSE)","v":20},{"$f":"VLOOKUP($J$13,$D$41:$Q$71,7,FALSE)","v":9},{"$f":"VLOOKUP($J$13,$D$41:$Q$71,8,FALSE)","v":4},{"$f":"VLOOKUP($J$13,$D$41:$Q$71,9,FALSE)","v":0},{"$f":"VLOOKUP($J$13,$D$41:$Q$71,10,FALSE)","v":0},{"$f":"VLOOKUP($J$13,$D$41:$Q$71,11,FALSE)","v":0},{"$f":"VLOOKUP($J$13,$D$41:$Q$71,12,FALSE)","v":1},{"$f":"VLOOKUP($J$13,$D$41:$Q$71,13,FALSE)","v":0},{"$f":"VLOOKUP($J$13,$D$41:$Q$71,14,FALSE)","v":1}]
[null,null,null,"SEMESTRE II",{"$f":"VLOOKUP($J$13,$D$80:$Q$104,2,FALSE)","v":0},{"$f":"VLOOKUP($J$13,$D$80:$Q$104,3,FALSE)","v":0},{"$f":"VLOOKUP($J$13,$D$80:$Q$104,4,FALSE)","v":6},{"$f":"VLOOKUP($J$13,$D$80:$Q$104,5,FALSE)","v":30},{"$f":"VLOOKUP($J$13,$D$80:$Q$104,6,FALSE)","v":22},{"$f":"VLOOKUP($J$13,$D$80:$Q$104,7,FALSE)","v":9},{"$f":"VLOOKUP($J$13,$D$80:$Q$104,8,FALSE)","v":5},{"$f":"VLOOKUP($J$13,$D$80:$Q$104,9,FALSE)","v":1},{"$f":"VLOOKUP($J$13,$D$80:$Q$104,10,FALSE)","v":2},{"$f":"VLOOKUP($J$13,$D$80:$Q$104,11,FALSE)","v":3},{"$f":"VLOOKUP($J$13,$D$80:$Q$104,12,FALSE)","v":0},{"$f":"VLOOKUP($J$13,$D$80:$Q$104,13,FALSE)","v":2},{"$f":"VLOOKUP($J$13,$D$80:$Q$104,14,FALSE)","v":1}]
{"$rows_left_out":78}
{"sheet":"Estrato","index":3,"n_rows":75,"n_cols":18,"rows_kept":75,"cut":false,"hidden":false,"merged":[[0,0,0,18],[10,12,12,14],[38,1,41,1],[34,1,34,17],[36,1,37,1],[36,2,37,2],[36,3,37,3],[36,4,36,10],[36,11,36,17],[9,1,9,17],[63,1,71,1],[72,1,72,3],[42,1,43,1],[45,1,50,1],[51,1,54,1],[55,1,56,1],[58,1,62,1]]}
["BOLETÍN ESTADÍSTICO 2011\nESTUDIANTES DE PREGRADO MATRICULADOS POR PRIMERA VEZ POR ESTRATO"]
[]
[]
[]
[]
[]
[]
[]
[]
[null,"Seleccione un programa académico de Pregrado"]
[null,null,null,null,33,{"$f":"VLOOKUP(E11,CONVENCIONES!A33:B66,2,FALSE)","v":"Tecnología Mecánica"}]
[]
[]
[]
[]
[]
[]
[]
[]
[]
[]
[]
[null,null,null,"SEMESTRE I",{"$f":"VLOOKUP($F$11,$D$39:$R$72,2,FALSE)","v":20},{"$f":"VLOOKUP($F$11,$D$39:$R$72,3,FALSE)","v":38},{"$f":"VLOOKUP($F$11,$D$39:$R$72,4,FALSE)","v":19},{"$f":"VLOOKUP($F$11,$D$39:$R$72,5,FALSE)","v":4},{"$f":"VLOOKUP($F$11,$D$39:$R$72,6,FALSE)","v":0},{"$f":"VLOOKUP($F$11,$D$39:$R$72,7,FALSE)","v":0}]
[null,null,null,"SEMESTRE II",{"$f":"VLOOKUP($F$11,$D$39:$R$72,9,FALSE)","v":15},{"$f":"VLOOKUP($F$11,$D$39:$R$72,10,FALSE)","v":40},{"$f":"VLOOKUP($F$11,$D$39:$R$72,11,FALSE)","v":17},{"$f":"VLOOKUP($F$11,$D$39:$R$72,12,FALSE)","v":10},{"$f":"VLOOKUP($F$11,$D$39:$R$72,13,FALSE)","v":1},{"$f":"VLOOKUP($F$11,$D$39:$R$72,14,FALSE)","v":0}]
[]
[]
[]
[]
[]
[]
{"$rows_left_out":46}
{"sheet":"Colegio","index":4,"n_rows":72,"n_cols":10,"rows_kept":72,"cut":false,"hidden":false,"merged":[[69,1,69,3],[0,0,0,16383],[33,1,34,1],[33,2,34,2],[33,3,34,3],[33,4,33,6],[33,7,33,9],[35,1,38,1],[39,1,40,1],[48,1,51,1],[42,1,47,1],[52,1,53,1],[55,1,59,1],[60,1,68,1],[9,1,9,9]]}
["BOLETÍN ESTADÍSTICO 2011\nESTUDIANTES DE PREGRADO MATRICULADOS POR PRIMERA VEZ\nPOR TIPO DE COLEGIO"]
[]
[]
[]
[]
[]
[]
[]
[]
[null,"Seleccione un programa académico de Pregrado"]
[null,null,null,null,null,10,{"$f":"VLOOKUP(F11,CONVENCIONES!A33:B66,2,FALSE)","v":"Ingeniería Industrial"}]
[]
[]
[]
[]
[]
[]
[]
[]
[]
[]
[]
[]
[]
[]
[]
[]
[null,null,null,"SEMESTRE I",{"$f":"VLOOKUP($G$11,$D$36:$J$69,2,FALSE)","v":58},{"$f":"VLOOKUP($G$11,$D$36:$J$69,3,FALSE)","v":28}]
[null,null,null,"SEMESTRE II",{"$f":"VLOOKUP($G$11,$D$36:$J$69,5,FALSE)","v":59},{"$f":"VLOOKUP($G$11,$D$36:$J$69,6,FALSE)","v":27}]
[]
{"$rows_left_out":43}
{"sheet":"Departamento","index":5,"n_rows":108,"n_cols":30,"rows_kept":108,"cut":false,"hidden":false,"merged":[[78,37,79,37],[39,39,39,42],[76,1,76,37],[0,0,0,31],[37,1,37,29],[9,1,9,29]]}
["BOLETÍN ESTADÍSTICO 2011\nESTUDIANTES DE PREGRADOMATRICULADOS POR PRIMERA VEZ\nPOR DEPARTAMENTO DE PROCEDENCIA"]
[]
[]
[]
[]
[]
[]
[]
[]
[null,"Seleccione un Programa Académico de Pregrado"]
[]
[null,null,null,null,null,null,null,null,null,null,null,null,null,null,null,1,{"$f":"VLOOKUP(P12,CONVENCIONES!A33:B66,2,FALSE)","v":"Administración del Medio Ambiente"}]
[]
[]
[]
[]
[]
[]
[]
[]
[]
[]
[]
[]
[null,"SEMESTRE I",{"$f":"VLOOKUP($Q$12,$B$41:$AD$71,2,FALSE)","v":0},{"$f":"VLOOKUP($Q$12,$B$41:$AD$71,3,FALSE)","v":0},{"$f":"VLOOKUP($Q$12,$B$41:$AD$71,4,FALSE)","v":0},{"$f":"VLOOKUP($Q$12,$B$41:$AD$71,5,FALSE)","v":0},{"$f":"VLOOKUP($Q$12,$B$41:$AD$71,6,FALSE)","v":8},{"$f":"VLOOKUP($Q$12,$B$41:$AD$71,7,FALSE)","v":0},{"$f":"VLOOKUP($Q$12,$B$41:$AD$71,8,FALSE)","v":0},{"$f":"VLOOKUP($Q$12,$B$41:$AD$71,9,FALSE)","v":1},{"$f":"VLOOKUP($Q$12,$B$41:$AD$71,10,FALSE)","v":0},{"$f":"VLOOKUP($Q$12,$B$41:$AD$71,11,FALSE)","v":0},{"$f":"VLOOKUP($Q$12,$B$41:$AD$71,12,FALSE)","v":0},{"$f":"VLOOKUP($Q$12,$B$41:$AD$71,13,FALSE)","v":0},{"$f":"VLOOKUP($Q$12,$B$41:$AD$71,14,FALSE)","v":0},{"$f":"VLOOKUP($Q$12,$B$41:$AD$71,15,FALSE)","v":0},{"$f":"VLOOKUP($Q$12,$B$41:$AD$71,16,FALSE)","v":0},{"$f":"VLOOKUP($Q$12,$B$41:$AD$71,17,FALSE)","v":0},{"$f":"VLOOKUP($Q$12,$B$41:$AD$71,18,FALSE)","v":2},{"$f":"VLOOKUP($Q$12,$B$41:$AD$71,19,FALSE)","v":0},{"$f":"VLOOKUP($Q$12,$B$41:$AD$71,20,FALSE)","v":1},{"$f":"VLOOKUP($Q$12,$B$41:$AD$71,21,FALSE)","v":1},{"$f":"VLOOKUP($Q$12,$B$41:$AD$71,22,FALSE)","v":60},{"$f":"VLOOKUP($Q$12,$B$41:$AD$71,23,FALSE)","v":0},{"$f":"VLOOKUP($Q$12,$B$41:$AD$71,24,FALSE)","v":0},{"$f":"VLOOKUP($Q$12,$B$41:$AD$71,25,FALSE)","v":0},{"$f":"VLOOKUP($Q$12,$B$41:$AD$71,26,FALSE)","v":1},{"$f":"VLOOKUP($Q$12,$B$41:$AD$71,27,FALSE)","v":8},{"$f":"VLOOKUP($Q$12,$B$41:$AD$71,28,FALSE)","v":0}]
[null,"SEMESTRE II",{"$f":"VLOOKUP($Q$12,$B$81:$AC$105,2,FALSE)","v":0},{"$f":"VLOOKUP($Q$12,$B$81:$AC$105,3,FALSE)","v":0},{"$f":"VLOOKUP($Q$12,$B$81:$AC$105,4,FALSE)","v":0},{"$f":"VLOOKUP($Q$12,$B$81:$AC$105,5,FALSE)","v":0},{"$f":"VLOOKUP($Q$12,$B$81:$AC$105,6,FALSE)","v":4},{"$f":"VLOOKUP($Q$12,$B$81:$AC$105,7,FALSE)","v":0},{"$f":"VLOOKUP($Q$12,$B$81:$AC$105,8,FALSE)","v":0},{"$f":"VLOOKUP($Q$12,$B$81:$AC$105,9,FALSE)","v":0},{"$f":"VLOOKUP($Q$12,$B$81:$AC$105,10,FALSE)","v":0},{"$f":"VLOOKUP($Q$12,$B$81:$AC$105,11,FALSE)","v":0},{"$f":"VLOOKUP($Q$12,$B$81:$AC$105,12,FALSE)","v":0},{"$f":"VLOOKUP($Q$12,$B$81:$AC$105,13,FALSE)","v":1},{"$f":"VLOOKUP($Q$12,$B$81:$AC$105,14,FALSE)","v":0},{"$f":"VLOOKUP($Q$12,$B$81:$AC$105,15,FALSE)","v":0},{"$f":"VLOOKUP($Q$12,$B$81:$AC$105,16,FALSE)","v":0},{"$f":"VLOOKUP($Q$12,$B$81:$AC$105,17,FALSE)","v":0},{"$f":"VLOOKUP($Q$12,$B$81:$AC$105,18,FALSE)","v":1},{"$f":"VLOOKUP($Q$12,$B$81:$AC$105,19,FALSE)","v":1},{"$f":"VLOOKUP($Q$12,$B$81:$AC$105,20,FALSE)","v":0},{"$f":"VLOOKUP($Q$12,$B$81:$AC$105,21,FALSE)","v":1},{"$f":"VLOOKUP($Q$12,$B$81:$AC$105,22,FALSE)","v":63},{"$f":"VLOOKUP($Q$12,$B$81:$AC$105,23,FALSE)","v":1},{"$f":"VLOOKUP($Q$12,$B$81:$AC$105,24,FALSE)","v":0},{"$f":"VLOOKUP($Q$12,$B$81:$AC$105,25,FALSE)","v":0},{"$f":"VLOOKUP($Q$12,$B$81:$AC$105,26,FALSE)","v":0},{"$f":"VLOOKUP($Q$12,$B$81:$AC$105,27,FALSE)","v":9},{"$f":"VLOOKUP($Q$12,$B$81:$AC$105,28,FALSE)","v":0}]
[]
[]
[]
[]
{"$rows_left_out":79}
{"sheet":"Municipio","index":6,"n_rows":109,"n_cols":19,"rows_kept":109,"cut":false,"hidden":false,"merged":[[38,1,38,18],[42,1,45,1],[46,1,47,1],[0,0,0,19],[49,1,53,1],[10,1,10,18],[106,1,106,3],[84,1,87,1],[88,1,91,1],[92,1,93,1],[95,1,98,1],[99,1,105,1],[54,1,57,1],[58,1,59,1],[61,1,65,1],[66,1,72,1],[82,1,83,1],[78,1,78,18],[73,1,73,3]]}
["BOLETÍN ESTADÍSTICO 2011\nESTUDIANTES DE PREGRADO MATRICULADOS POR PRIMERA VEZ\nPOR MUNICIPIO DE PROCEDENCIA"]
[]
[]
[]
[]
[]
[]
[]
[]
[]
[null,"Seleccione un programa académico de Pregrado"]
[]
[null,null,null,null,null,null,null,1,{"$f":"VLOOKUP(H13,CONVENCIONES!A33:B66,2,FALSE)","v":"Administración del Medio Ambiente"}]
[]
[]
[]
[]
[]
[]
[]
[]
[]
[]
[]
[]
[]
[]
[]
[]
[]
{"$rows_left_out":80}
{"sheet":"Región","index":7,"n_rows":128,"n_cols":15,"rows_kept":128,"cut":false,"hidden":false,"merged":[[50,10,52,14],[13,10,16,14],[127,1,128,8],[87,1,88,8],[96,5,97,5],[98,5,104,5],[105,5,108,5],[109,5,115,5],[96,8,97,8],[98,8,104,8],[105,8,108,8],[109,8,115,8],[116,5,121,5],[116,8,121,8],[98,7,104,7],[96,1,97,1],[96,7,97,7],[98,1,104,1],[96,4,97,4],[98,4,104,4],[105,1,108,1],[109,1,115,1],[116,1,121,1],[105,7,108,7],[109,7,115,7],[116,7,121,7],[105,4,108,4],[109,4,115,4],[116,4,121,4],[56,4,57,4],[58,4,64,4],[65,4,68,4],[69,4,75,4],[56,5,57,5],[58,5,64,5],[65,5,68,5],[69,5,75,5],[0,0,0,16383],[50,1,52,8],[56,1,57,1],[58,1,64,1],[69,1,75,1],[54,6,54,8],[54,3,54,5],[54,2,55,2],[54,1,55,1],[65,1,68,1],[56,8,57,8],[58,8,64,8],[65,8,68,8],[56,7,57,7],[65,7,68,7],[58,7,64,7],[76,8,81,8],[69,8,75,8],[94,2,95,2],[94,1,95,1],[94,3,94,5],[94,6,94,8],[90,1,92,8],[76,1,81,1],[76,7,81,7],[76,4,81,4],[76,5,81,5],[83,1,83,2],[69,7,75,7]]}
["BOLETÍN ESTADÍSTICO 2011\nESTUDIANTES DE PREGRADO MATRICULADOS POR PRIMERA VEZ\nSEGÚN SU REGIÓN DE PROCEDENCIA"]
[]
[]
[]
[]
[]
[]
[]
[]
[]
[]
[]
[]
[null,null,null,null,null,null,null,null,null,null,{"$f":"CONCATENATE(\"Matriculados en primer semestre \",F16)","v":"Matriculados en primer semestre Risaralda"}]
[]
[null,null,null,null,null,"Risaralda"]
[]
[]
[]
[]
[]
[]
[]
[]
[]
[]
[]
[]
[null,null,null,null,null,null,null,null,null,"SEMESTRE I",{"$f":"VLOOKUP(F16,K56:M61,2,FALSE)","v":1820}]
[null,null,null,null,null,null,null,null,null,"SEMESTRE II",{"$f":"VLOOKUP(F16,K56:M61,3,FALSE)","v":1480}]
{"$rows_left_out":99}
{"sheet":"Excepcion","index":8,"n_rows":40,"n_cols":15,"rows_kept":40,"cut":false,"hidden":false,"merged":[[0,0,0,15],[11,1,12,1],[11,3,12,3],[11,2,12,2],[11,4,11,8],[11,9,11,14],[9,1,9,14],[28,1,30,1],[31,1,36,1],[37,1,37,3],[13,1,15,1],[16,1,17,1],[19,1,22,1],[23,1,24,1],[25,1,26,1]]}
["BOLETÍN ESTADÍSTICO 2011\nMATRICULADOS POR PRIMERA VEZ SEGÚN MECANISMOS DE EXCEPCIÓN"]
[]
[]
[]
[]
[]
[]
[]
[]
[null,"MATRICULADOS POR PRIMERA VEZ SEGÚN MECANISMOS DE EXCEPCIÓN 2011"]
[]
[null,"FACULTAD","COD","PROGRAMA ACADÉMICO","SEMESTRE I",null,null,null,null,"SEMESTRE II"]
[null,null,null,null,"Comunidad Indigena","Deportistas de Alto Rendimiento","Desplazado","Negritudes","Total","Comunidad Indigena","Deportistas de Alto Rendimiento","Desplazado","Negritudes","Reinsertado","Total"]
[null,"Facultad de Bellas Artes y Humanidades",1,"Licenciatura en Música",0,0,0,2,2,null,null,null,null,null,0]
[null,null,66,"Licenciatura en Filosofía (Nocturno)",0,0,1,1,2,null,null,null,null,null,0]
[null,null,68,"Licenciatura en Lengua Inglesa",2,1,1,2,6,2,0,1,3,0,6]
[null,"Facultad de Ciencias Ambientales",27,"Administración del Medio Ambiente",1,0,1,2,4,0,2,1,1,0,4]
[null,null,"AG","Técnico Profesional en Procesos del Turismo Sostenible (por ciclos propedéuticos)",1,0,1,0,2,0,0,1,1,0,2]
[null,"Facultad de Ciencias Básicas",7,"Licenciatura en Matemáticas y Física",0,0,1,1,2,null,null,null,null,null,0]
[null,"Facultad de Ciencias de la Educación",6,"Licenciatura en Comunicación e Informática Educativa",0,0,3,1,4,1,1,2,1,0,5]
[null,null,9,"Licenciatura en Español y Literatura (Nocturno)",1,0,0,0,1,2,0,3,2,0,7]
[null,null,21,"Licenciatura en Etnoeducación y Desarrollo Comunitario",1,0,2,1,4,null,null,null,null,null,0]
[null,null,33,"Licenciatura en Pedagogía Infantil",1,0,3,1,5,2,0,1,6,1,10]
[null,"Facultad de Ciencias de la Salud",31,"Medicina",1,1,1,0,3,2,1,1,1,0,5]
[null,null,32,"Ciencias del Deporte y la Recreación",2,1,0,1,4,0,5,2,2,0,9]
[null,"Facultad de Ingeniería Industrial",13,"Ingeniería Industrial",1,1,1,2,5,2,0,0,0,0,2]
[null,null,38,"Ingeniería Industrial (Nocturno)",null,null,null,null,0,0,1,0,0,0,1]
[null,"Facultad de Ingeniería Mecánica",14,"Ingeniería Mecánica",1,1,3,1,6,2,0,3,3,0,8]
[null,"Facultad de Ingenierías Eléctrica, Electrónica, Física y Ciencias de la Computación",12,"Ingeniería Eléctrica",1,1,0,2,4,0,0,5,0,0,5]
[null,null,28,"Ingeniería de Sistemas y Computación",1,0,2,1,4,1,0,2,3,0,6]
{"$rows_left_out":11}
{"sheet":"Pos_Genero","index":9,"n_rows":73,"n_cols":10,"rows_kept":73,"cut":false,"hidden":false,"merged":[[45,1,46,1],[47,1,50,1],[51,1,56,1],[57,1,60,1],[68,1,68,3],[63,1,66,1],[61,1,62,1],[42,1,44,1],[0,0,0,10],[9,1,9,9],[34,1,34,9],[37,1,38,1],[39,1,41,1],[37,4,37,6],[37,7,37,9],[37,3,38,3],[37,2,38,2]]}
["BOLETÍN ESTADÍSTICO 2011\nESTUDIANTES MATRICULADOS EN PRIMER CURSO\n DE PROGRAMAS DE POSGRADO"]
[]
[]
[]
[]
[]
[]
[]
[null,null,1,{"$f":"VLOOKUP(C9,CONVENCIONES!A2:B30,2,FALSE)","v":"Doctorado en Ciencias Ambientales (Convenio con la Universidad del Valle y la Universidad del Cauca)"}]
[null,"Seleccione un Programa Académico de Posgrado"]
[]
[]
[]
[]
[]
[]
[]
[]
[]
[]
[]
[]
[]
[]
[]
[]
[]
[]
[]
[null,null,null,"SEMESTRE I",{"$f":"VLOOKUP($D$9,$D$40:$J$68,2,FALSE)","v":0},{"$f":"VLOOKUP($D$9,$D$40:$J$68,3,FALSE)","v":0}]
{"$rows_left_out":44}
{"sheet":"Res_Municipios","index":10,"n_rows":71,"n_cols":8,"rows_kept":71,"cut":false,"hidden":false,"merged":[[48,1,50,7],[52,1,53,1],[52,2,52,4],[52,5,52,7],[0,0,0,8]]}
["BOLETÍN ESTADÍSTICO 2011\nDEMANDA DE INGRESO Y MATRÍCULA POR PRIMERA VEZ \nEN PREGRADO PARA LOS MUNICIPIOS DE RISARALDA"]
[]
[]
[]
[]
[]
[]
[]
[]
[null,null,null,"Seleccione un Municipio a Visualizar haciendo click en el mapa"]
[]
[]
[]
[]
[]
[]
[]
[]
[null,null,null,null,null,null,null,"Santa Rosa de Cabal"]
[]
[]
[]
[]
[]
[null,null,null,null,null,null,"SEMESTRE I",{"$f":"VLOOKUP(H19,B55:D68,3,FALSE)","v":115}]
[null,null,null,null,null,null,"SEMESTRE II",{"$f":"VLOOKUP(H19,B55:G68,6,FALSE)","v":96}]
[]
[]
[]
[]
{"$rows_left_out":42}
{"sheet":"Ins_Cup_Adm","index":11,"n_rows":80,"n_cols":12,"rows_kept":80,"cut":false,"hidden":false,"merged":[[76,1,76,3],[62,1,66,1],[67,1,75,1],[0,0,0,12],[40,1,41,1],[40,2,41,2],[40,3,41,3],[40,4,40,7],[40,8,40,11],[42,1,45,1],[46,1,47,1],[49,1,54,1],[55,1,58,1],[59,1,60,1],[9,1,9,11]]}
["BOLETÍN ESTADÍSTICO 2011\nESTUDIANTES INSCRITOS, CUPOS, ADMITIDOS Y MATRICULADOS\nPOR PROGRAMA ACADÉMICO"]
[]
[]
[]
[]
[]
[]
[]
[]
[null,"Seleccione un programa académico de Pregrado"]
[null,null,null,null,null,null,4,{"$f":"VLOOKUP(G11,CONVENCIONES!A33:B66,2,FALSE)","v":"Ingeniería de Sistemas y Computación"}]
[]
[]
[]
[]
[]
[]
[]
[]
[]
[]
[]
[]
[]
[]
[]
[]
[]
[]
[null,null,null,"SEMESTRE I",{"$f":"VLOOKUP($H$11,$D$43:$L$76,2,FALSE)","v":283},{"$f":"VLOOKUP($H$11,$D$43:$L$76,3,FALSE)","v":81},{"$f":"VLOOKUP($H$11,$D$43:$L$76,4,FALSE)","v":81},{"$f":"VLOOKUP($H$11,$D$43:$L$76,5,FALSE)","v":81}]
{"$rows_left_out":51}
{"sheet":"Icfes","index":12,"n_rows":49,"n_cols":19,"rows_kept":49,"cut":false,"hidden":false,"merged":[[0,0,0,16383],[11,1,12,1],[11,2,12,2],[11,3,12,3],[11,4,11,9],[11,10,11,15],[11,17,11,18],[33,1,37,1],[38,1,46,1],[13,1,16,1],[17,1,18,1],[20,1,25,1],[26,1,29,1],[30,1,31,1]]}
["BOLETÍN ESTADÍSTICO 2011\nPROMEDIO DE LOS PUNTAJES DE LAS PRUEBAS ICFES DE LOS ESTUDIANTES\nMATRICULADOS POR PRIMERA VEZ POR PROGRAMA ACADÉMICO"]
[]
[]
[]
[]
[]
[]
[]
[]
[]
[]
[null,"FACULTAD","COD","PROGRAMA","I SEMESTRE",null,null,null,null,null,"II SEMESTRE",null,null,null,null,null,null,"CONVENCIONES"]
[null,null,null,null,"PA","S","CV","PN","S","CV","PA","S","CV","PN","S","CV",null,"PA","Pruebas Antiguas"]
[null,"Facultad de Bellas Artes y Humanidades",1,"Licenciatura en Música",165.81666666666669,16.726052532899878,{"$f":"F14/E14","v":0.10087075605327094},67.627292682926836,17.146561175218206,{"$f":"I14/H14","v":0.25354498893827554},null,null,null,null,null,null,null,"PN","Pruebas Nuevas"]
[null,null,4,"Licenciatura en Artes Visuales",266,null,{"$f":"F15/E15","v":0},53.978030303030302,5.9626966588300219,{"$f":"I15/H15","v":0.11046525086883874},null,null,null,null,null,null,null,"S","Desviación Estándar"]
[null,null,66,"Licenciatura en Filosofía (Nocturno)",367.5,164.75588001646557,{"$f":"F16/E16","v":0.4483153197726954},52.482820512820496,7.998137924317855,0.1523953523489476,null,null,null,null,null,null,null,"CV","Coeficiente de Variación"]
[null,null,68,"Licenciatura en Lengua Inglesa",278,0,{"$f":"F17/E17","v":0},57.282500000000013,7.9912160317854077,0.13950536432218227,247,null,{"$f":"L17/K17","v":0},52.648452380952392,5.3333618083181209,{"$f":"O17/N17","v":0.10130139761235736}]
[null,"Facultad de Ciencias Ambientales",27,"Administración del Medio Ambiente",0,0,null,55.75951219512195,6.1907471581702387,0.11102584858537963,0,0,null,51.818641975308637,4.6207631277438059,8.9171829897541119E-2]
[null,null,"AG","Técnico Profesional en Procesos del Turismo Sostenible (por ciclos propedéuticos)",259.60000000000002,55.319978308021803,{"$f":"F19/E19","v":0.21309698885986825},46.760357142857139,6.110968303456688,0.13068694673967363,259.66666666666669,44.161823633843099,0.17007120783251514,44.719873417721516,3.8045719775672988,8.5075642813864261E-2]
[null,"Facultad de Ciencias Básicas",7,"Licenciatura en Matemáticas y Física",268,30.397368307141328,{"$f":"F20/E20","v":0.11342301607142287},51.395192307692319,6.4726612069183398,0.12593904052674545]
[null,"Facultad de Ciencias de la Educación",6,"Licenciatura en Comunicación e Informática Educativa",303,null,{"$f":"F21/E21","v":0},54.036125000000006,5.7966763706629889,0.10727409433342951,0,0,null,49.71443037974683,3.9049297399489369,7.8547208730360252E-2]
[null,null,9,"Licenciatura en Español y Literatura (Nocturno)",259.875,28.577901052586569,{"$f":"F22/E22","v":0.10996787321822633},50.32694915254239,9.1089431716453593,0.1809953379855373,269,29.698484809834994,0.11040328925589217,49.133492063492064,5.9242040866617529,0.12057364208931626]
[null,null,21,"Licenciatura en Etnoeducación y Desarrollo Comunitario",242.33333333333334,71.087739214766586,{"$f":"F23/E23","v":0.29334692935942192},47.962549019607849,7.8390187761319243,0.16344041207916638]
[null,null,33,"Licenciatura en Pedagogía Infantil",253.5,2.1213203435596424,{"$f":"F24/E24","v":8.3681275880064781E-3},50.026415094339633,5.3788724590584511,0.10752064582111256,305,null,0,47.019009009008997,3.6705894881923578,7.8066075095054865E-2]
[null,null,80,"Licenciatura en Pedagogía Infantil (CERES Quinchía - Risaralda)",0,0,null,0,0]
[null,null,"DY","Licenciatura en Pedagogía Infantil (CERES Puerto Caldas (Pereira) - Risaralda)",null,null,null,null,null,null,0,0,null,0,0]
[null,"Facultad de Ciencias de la Salud",31,"Medicina",0,0,null,73.548709677419367,10.553001823561862,0.14348316741172965,0,0,null,65.603124999999991,7.01942585157206,0.10699834575825558]
[null,null,32,"Ciencias del Deporte y la Recreación",0,0,null,55.511976744186036,4.5242369053714784,8.1500194565586562E-2,0,0,null,53.78819277108434,5.6211912079676223,0.10450604339674865]
[null,null,92,"Medicina Veterinaria y Zootecnia",0,0,null,51.032291666666659,6.2252851731940462,0.12198717654806567,317,null,0,50.727111111111128,6.5453340848902855,0.12903029448204895]
[null,null,99,"Tecnología en Atención Prehospitalaria",0,0,null,50.633095238095244,5.8456640124801984,0.11545144504778462,0,0,null,49.200294117647054,6.2550476515366542,0.12713435485933625]
{"$rows_left_out":20}
{"sheet":"Ind_Cobertura","index":13,"n_rows":25,"n_cols":3,"rows_kept":25,"cut":false,"hidden":false,"merged":[[24,1,25,2],[0,0,0,12],[8,1,8,2],[17,1,17,2]]}
["BOLETÍN ESTADÍSTICO 2011\nINDICADORES DE COBERTURA"]
[]
[]
[]
[]
[]
[]
[]
[null,"INDICADORES DE COBERTURA 2011 - I"]
[]
[null,"DESCRIPCIÓN","COBERTURA"]
[null,"Admitidos / Inscritos",0.502]
[null,"Matriculados / Inscritos",0.37130000000000002]
[null,"Matriculados / Admitidos",0.73960000000000004]
[]
[]
[]
[null,"INDICADORES DE COBERTURA 2011 - II"]
[]
[null,"DESCRIPCIÓN","COBERTURA"]
[null,"Admitidos / Inscritos",0.75529999999999997]
[null,"Matriculados / Inscritos",0.45529999999999998]
[null,"Matriculados / Admitidos",0.6]
[]
[null,"Fuente: Base de datos del centro de registro y control académico"]

{"sheet":"Tendencia","index":14,"n_rows":97,"n_cols":22,"rows_kept":97,"cut":false,"hidden":false,"merged":[[36,20,36,21],[94,20,94,21],[0,0,0,22],[36,18,36,19],[34,1,34,19],[36,1,37,1],[36,2,37,2],[36,3,37,3],[36,4,36,5],[36,8,36,9],[36,10,36,11],[36,12,36,13],[36,14,36,15],[36,16,36,17],[9,1,9,21],[94,1,94,3],[94,12,94,13],[94,14,94,15],[94,16,94,17],[94,18,94,19],[94,4,94,5],[94,6,94,7],[94,8,94,9],[94,10,94,11],[76,1,92,1],[93,1,93,3],[36,6,36,7],[38,1,44,1],[45,1,47,1],[49,1,60,1],[71,1,73,1],[74,1,75,1],[61,1,65,1],[66,1,70,1]]}
["BOLETÍN ESTADÍSTICO 2011\nESTUDIANTES MATRICULADOS POR PRIMERA VEZ\nEN PROGRAMAS DE PREGRADO (2003 - 2011)"]
[]
[]
[]
[]
[]
[]
[]
[]
[null,"Seleccione un Programa Académico de Pregrado"]
[]
[null,null,null,null,null,null,null,null,null,null,null,null,null,1,{"$f":"VLOOKUP(N12,CONVENCIONES!A33:B66,2,FALSE)","v":"Administración del Medio Ambiente"}]
[]
[]
[]
[]
[]
[]
[]
[null,null,null,null,2003,{"$f":"E20+1","v":2004},{"$f":"F20+1","v":2005},2006,2007,2008,2009,2010,2011]
[null,null,null,"SEMESTRE I",{"$f":"VLOOKUP($O$12,$D$39:$V$93,2,FALSE)","v":76},{"$f":"VLOOKUP($O$12,$D$39:$V$93,4,FALSE)","v":75},{"$f":"VLOOKUP($O$12,$D$39:$V$93,6,FALSE)","v":84},{"$f":"VLOOKUP($O$12,$D$39:$V$93,8,FALSE)","v":75},{"$f":"VLOOKUP($O$12,$D$39:$V$93,10,FALSE)","v":77},{"$f":"VLOOKUP($O$12,$D$39:$V$93,12,FALSE)","v":83},{"$f":"VLOOKUP($O$12,$D$39:$V$93,14,FALSE)","v":82},{"$f":"VLOOKUP($O$12,$D$39:$V$93,16,FALSE)","v":81},{"$f":"VLOOKUP($O$12,$D$39:$V$93,18,FALSE)","v":82}]
[null,null,null,"SEMESTRE II",{"$f":"VLOOKUP($O$12,$D$39:$V$93,3,FALSE)","v":81},{"$f":"VLOOKUP($O$12,$D$39:$V$93,5,FALSE)","v":76},{"$f":"VLOOKUP($O$12,$D$39:$V$93,7,FALSE)","v":81},{"$f":"VLOOKUP($O$12,$D$39:$V$93,9,FALSE)","v":64},{"$f":"VLOOKUP($O$12,$D$39:$V$93,11,FALSE)","v":81},{"$f":"VLOOKUP($O$12,$D$39:$V$93,13,FALSE)","v":81},{"$f":"VLOOKUP($O$12,$D$39:$V$93,15,FALSE)","v":81},{"$f":"VLOOKUP($O$12,$D$39:$V$93,17,FALSE)","v":84},{"$f":"VLOOKUP($O$12,$D$39:$V$93,19,FALSE)","v":81}]
[]
[]
[]
[]
[]
[]
[]
[]
{"$rows_left_out":68}
{"sheet":"CONVENCIONES","index":15,"n_rows":66,"n_cols":2,"rows_kept":66,"cut":false,"hidden":true,"merged":[[0,0,0,1],[31,0,31,1]]}
["POSGRADO"]
[1,"Doctorado en Ciencias Ambientales (Convenio con la Universidad del Valle y la Universidad del Cauca)"]
[{"$f":"1+A2","v":2},"Doctorado en Ciencias Biomédicas"]
[{"$f":"1+A3","v":3},"Doctorado en Ciencias de la Educación, Área Pensamiento Educativo y Comunicación"]
[4,"Doctorado en Ingeniería"]
[5,"Especialización en Gerencia del Deporte y la Recreación"]
[6,"Especialización en Logística Empresarial"]
[7,"Especialización en Medicina Crítica y Cuidado Intensivo"]
[8,"Especialización en Medicina Interna"]
[9,"Especialización en Radiología e Imágenes Diagnósticas"]
[10,"Especialización en Redes de Datos"]
[11,"Maestría en Administración del Desarrollo Humano y Organizacional"]
[12,"Maestría en Administración Económica y Financiera"]
[13,"Maestría en Administración Económica y Financiera (Extensión Tunja - Boyacá)"]
[14,"Maestría en Biología Molecular y Biotecnología"]
[15,"Maestría en Biología Vegetal"]
[16,"Maestría en Ciencias Ambientales"]
[17,"Maestría en Comunicación Educativa"]
[18,"Maestría en Educación"]
[19,"Maestría en Enseñanza de la Matemática"]
[20,"Maestría en Estética y Creación"]
[21,"Maestría en Historia"]
[22,"Maestría en Ingeniería de Sistemas y Computación"]
[23,"Maestría en Ingeniería Eléctrica"]
[24,"Maestría en Ingeniería Mecánica"]
[25,"Maestría en Instrumentación Física"]
[26,"Maestría en Literatura"]
[27,"Maestría en Literatura (Extensión Ibagué - Tolima, en convenio con la Universidad del Tolima)"]
[28,"Maestría en Sistemas Automáticos de Producción"]
[29,"Maestría en Sistemas Integrados de Gestión de la Calidad"]
{"$rows_left_out":36}